想象一座城市:CPU 是市政府,内存是中央仓库,UART、蓝牙、定时器则是散布街区的商铺。如果每栋楼之间都单独修一条路,城市会被道路淹没。于是规划部门规定:所有建筑接入统一路网,车辆按规则行驶——这条路网,就是芯片里的“总线”。区别在于,芯片(SoC)内部的“路”是一束金属线,而 AMBA 就是 ARM 公司发布的《城市道路设计规范》:AHB 是城市主干道,双向多车道、有红绿灯管理;APB 是连接小商铺的社区小巷,简单便宜、车速慢;AXI 则是新时代的多车道立体高速,进城与出城各有专用道,多辆车互不等待地连续通行。路口“交警”是仲裁器,“匝道”是桥接器。理解了这三类路的规划与配合,你就摸清了 AI 芯片里数据如何在 CPU、NPU、内存与外设之间“跑”起来。

岗位关联

对 AI 从业者来说,掌握片上总线的带宽、流水与仲裁逻辑,就能定位“算力充足但推理慢”的根因——瓶颈往往不在计算单元,而在数据通路上。

目录
  1. 可视化演示
  2. 总线基础概念
  3. AMBA规范总览
  4. AHB高速总线
  5. APB外设总线
  6. AXI高性能总线
  7. 仲裁与性能
  8. 工程选型实践
  9. AI 应用场景
  10. Python 演示
  11. 常见误区
  12. 面试题

可视化演示

展示系统处理流水线、实时性能指标曲线及多方案对比分析,包含数据流转、吞吐延迟监控与方案评估。

本节配有交互动效(进入视口后自动加载,约 3KB)。

系统可视化 处理流程:输入→处理→模型→输出 性能监控:实时指标 P=L×T

总线基础概念

正如一座城市不可能为每栋楼都单独修一条路,一颗 SoC 芯片也不可能为每个模块拉一条独立连线。想象你在规划一个小区:若每户房门都直接通向高速公路,道路造价和用地都吃不消;正确做法是先修一条小区主路,再让各家各户通过支路接入。在芯片上,这条“主路”就是总线——一束被所有模块共享的地址线、数据线与控制线,外加一套“怎么开车”的协议规则。

总线至少包含三类信号线:数据线决定一次能并排运多少“货物”(8 位、32 位、128 位),地址线决定这批货送给哪栋楼,控制线负责说明“这是读还是写、什么时候生效”。发起访问的一方叫主设备(Master),比如 CPU、DMA 控制器;被动响应的一方叫从设备(Slave),比如内存控制器、UART 寄存器。主设备像发单的顾客,从设备像接单的商户,总线就是它们之间传递订单的公共通道。

与电脑主板上几十厘米长的 PCIe、USB 线不同,片上总线是芯片内部的一层金属走线,距离以毫米计,不需要复杂的差分信号和终端匹配。它的设计目标更加直白:低延迟(数据在芯片内流转要快)、低功耗(每翻转一次总线都耗电)、面积小(导线占用宝贵的硅片面积)。这些约束决定了 SoC 内部宁可让模块排队用共享总线,也不愿给每个模块都铺一条专用线。

B=W×f\displaystyle B = W \times f

1. B——带宽:代表单位时间能搬运的数据总量,决定整条路上每秒能通过的比特数,是评估总线性能的第一指标。

B=W×f\displaystyle B = W \times f

2. W——数据线宽度:每一次节拍并排传输的位数,即路面的车道数,是决定带宽的第一个乘数因子。

Wbus\displaystyle W_{\text{bus}}

3. f——时钟频率:每秒完成的节拍数,是决定带宽的第二个乘数因子,限速越高单位时间跑过的车就越多。

fclk\displaystyle f_{\text{clk}}

所以,选总线就像选公路:车道数(位宽)与限速(频率)共同决定吞吐极限。但光有宽路和高速还不够——如果路口没有红绿灯(握手机制)、交警(仲裁器),车流一样会堵死。这正是下面各协议要解决的问题。

AMBA规范总览

城市里的道路不能想怎么修就怎么修,建筑、交管、市政必须共同遵守一份《城市道路设计规范》。芯片世界也一样:ARM 公司于 1996 年前后提出 AMBA(Advanced Microcontroller Bus Architecture)协议,像一份城市规划法典,规定了 SoC 内部各模块如何互连。如今几乎每颗手机 SoC、AI 加速芯片的 IP 都按 AMBA 设计接口。

AMBA 家族历经多次升级。AMBA 2 时代诞生了 AHB 与 APB 这对“主干道 + 社区路”的黄金搭档;AMBA 3 引入 AXI,为高性能存储访问修起了“立体高速”;AMBA 4/5 继续扩展出 ACE(缓存一致性扩展)与 CHI(面向多核的一致性互连)。新协议并不取代旧协议,而是各司其职——你的芯片里可能同时用着 AXI、AHB 和 APB,就像一座城市同时拥有高速路、主干道和小巷。

AMBA 的层次化思想可以概括为“以快慢分层”:CPU、NPU、DDR 控制器这些高速模块挂在 AXI/AHB 上;数量庞大但速度要求不高的外设(UART、SPI、GPIO、定时器)统一通过桥接器挂到 APB 上。桥接器如同高速路出口的匝道,车流从主干道减速进入社区路,速度降下来但成本也降下来。这种设计让“快路走快车、慢路走慢车”,避免所有模块挤在同一条路上互相拖累。

Tperiph=Tahb+2×Tclk_apb\displaystyle T_{\text{periph}} = T_{\text{ahb}} + 2 \times T_{\text{clk\_apb}}

1. T_periph——外设访问总耗时:从主设备发出请求到数据返回的总时间,相当于从主干道匝道口到社区小店门口的整体路程。

Tperiph\displaystyle T_{\text{periph}}

2. T_ahb——高速段耗时:请求在 AHB 上从发起方走到桥接器的时间,通常只有一两个时钟周期。

Tahb=1∼2×Tahb_clk\displaystyle T_{\text{ahb}} = 1 \sim 2 \times T_{\text{ahb\_clk}}

3. 2×T_clk_apb——桥接转换时间:桥接器把 AHB 请求翻译成 APB 的建立/访问两拍所需时间,这是低速外设访问无法绕开的“减速带”。

Tbridge=2×Tclk_apb\displaystyle T_{\text{bridge}} = 2 \times T_{\text{clk\_apb}}

AMBA 的层次化设计就像城市规划中的“快慢分离”:高速通道保证核心数据流畅通,低速通道让海量外设安静地挂在网上。设计者不需要给每个小店铺都修高速,整体成本自然可控——这正是一颗复杂 SoC 能容纳几十个外设却依然高效的原因。

AHB高速总线

有了城市道路规范,我们来看看 AHB 这条“城市主干道”。主干道最显著的特征是流水线:绿灯亮起时,第一辆车起步,紧随其后的第二辆车已压上斑马线,第三辆也蓄势待发——并非等第一辆完全通过路口才放行第二辆。AHB 的传输正是这个节奏:地址相与数据相错开一拍重叠,用“流水”代替“排队”。

AHB(Advanced High-performance Bus)是共享总线架构,支持一个或多个主设备。它有两个关键特性:流水传输与突发传输(burst)。流水传输中,主设备在第一个时钟周期发出地址,从设备在下一周期给出数据,与此同时主设备又能发出下一个地址——地址管线与数据管线并行推进。HREADY 信号由从设备控制,表示“我还没准备好,请等一拍”,相当于主干道上的临时限行;HREADY 拉低会让整个流水线停顿,这正是从设备插入等待周期的机制。

一次 AHB 传输分为两相:地址相(发送地址及 HWRITE、HSIZE、HTRANS 等控制信号)和数据相(读写 HWDATA/HRDATA)。两相错开的精髓在于:后一笔的地址相可以和前一笔的数据相重叠。突发传输支持 INCR(地址递增)与 WRAP(回绕)两种模式,非常适合搬运缓存线或连续数组。当有多个主设备时,仲裁器通过 HBUSREQ 与 HGRANT 信号决定谁能在下一拍占用总线。

ηahb=NN+1\displaystyle \eta_{\text{ahb}} = \frac{N}{N + 1}

1. N——突发笔数:一次突发传输中包含的连续数据传输次数,比如 4、8 或 16 笔,相当于车队一次性连续通过路口的车辆数。

N=4, 8, 16\displaystyle N = 4,\ 8,\ 16

2. N+1——总时钟拍数:流水线在启动时需要一个额外节拍建立地址管线,之后每一拍完成一笔数据。

Ttotal=N+1 拍\displaystyle T_{\text{total}} = N + 1 \ \text{拍}

3. η_ahb——传输效率:有效数据拍数占总拍数的比例,N 越大效率越接近 100%,这是流水线相对串行的核心优势。

ηahb=NN+1→1(N→∞)\displaystyle \eta_{\text{ahb}} = \frac{N}{N+1} \to 1 \quad (N \to \infty)

回到城市比喻:AHB 主干道让车辆一辆接一辆通过路口,即使每拍只放行一辆,吞吐也比“每辆车停三次”的普通交叉口高得多。但主干道也有代价——需要红绿灯(HREADY)、交警(仲裁器)维持秩序,这正是它与安静小巷(APB)的本质区别。

APB外设总线

并非所有地方都需要宽阔的主干道。社区里的便利店、洗衣店客流小、规模小,一条安静的小巷就够用了;若硬把小巷建成八车道,不仅浪费土地,还让沿街居民不得安宁。APB(Advanced Peripheral Bus)就是这条小巷,专门服务 UART、I2C、SPI、GPIO、定时器等低速外设。

APB 的设计哲学是“极简”:它只有一个主设备——桥接器,因此完全不需要总线仲裁;不支持流水与突发,整个协议就是一个三状态有限状态机:IDLE(空闲)→ SETUP(建立)→ ACCESS(访问)。一次读或写访问固定两拍:SETUP 拍把地址和外设选择信号 PSEL 置有效;ACCESS 拍把使能信号 PENABLE 拉高,完成数据读写。之后要么回到 IDLE,要么进入下一笔传输。

APB 的低功耗来自两点:一是无仲裁、无流水,控制逻辑极其简单,翻转的触发器少;二是外设可以分布在独立时钟域,通过时钟门控(clock gating)在空闲时停掉整条 APB 的时钟。由于 APB 外设都是寄存器级访问(读写状态寄存器),两拍延迟完全可接受。从 AHB/AXI 到 APB 需要桥接器完成协议转换、地址译码和等待插入,桥接器还承担着“小巷口限速牌”的角色,防止高速信号直接冲击低速外设。

Ttotal=Tsetup+Taccess=2×Tclk\displaystyle T_{\text{total}} = T_{\text{setup}} + T_{\text{access}} = 2 \times T_{\text{clk}}

1. T_setup——建立拍:第一拍把地址、PSEL 等控制信号稳定输出,为读写做好准备,相当于小巷口的指路牌先亮起。

Tsetup=1×Tclk\displaystyle T_{\text{setup}} = 1 \times T_{\text{clk}}

2. T_access——访问拍:第二拍拉高 PENABLE,数据在总线上有效完成读写,相当于货物送到店门口并完成签收。

Taccess=1×Tclk\displaystyle T_{\text{access}} = 1 \times T_{\text{clk}}

3. T_total——两拍合计:两者相加得到固定两拍延迟,任何一笔 APB 访问都不能少于这个时间。

Ttotal=2×Tclk\displaystyle T_{\text{total}} = 2 \times T_{\text{clk}}

城市里正是这些不起眼的小巷,连接着数以千计的“小店铺”,构成生活的毛细血管。APB 的价值不在速度,而在“用最小的成本服务最多的慢速设备”——当整条街都安静下来时,时钟一停,功耗就下来了。

AXI高性能总线

如果把 AHB 比作双向两车道主干道,那么 AXI 就是现代立体交通枢纽:进城匝道、出城匝道、人行天桥彼此互不干涉,高峰期多股车流同时流动也不互相阻挡。AXI(Advanced eXtensible Interface)从设计上把每一次传输拆成五条独立通道,让读写彻底分离,不再存在“一辆车占住路口、双向都得等”的局面。

五个通道分别是:读地址通道(AR)、读数据通道(R)、写地址通道(AW)、写数据通道(W)、写响应通道(B)。每个通道都使用独立的 VALID/READY 握手:发送方拉高 VALID 表示“我有数据要发”,接收方拉高 READY 表示“我现在能接收”,两者同时为高时一拍完成传输。读写通道互不依赖,因此可以同时进行“发写地址和数据”与“接收读数据”,这就是 AI 芯片能边加载权重边反馈结果的底层原因。

AXI 最革命性的特性是支持 outstanding 传输——主设备不等第一笔事务完成就继续发出后续事务。每笔事务携带独立 ID 标识,从设备(如 DDR 控制器)可以乱序返回结果,主设备按 ID 重新排序。这让存储访问延迟被“藏”起来:只要数据源源不断,总线就能一直接收新请求,像流水线不断塞入原料,而不是等上一件加工完才递下一件。AXI4 还支持单次突发最多 256 拍,配合 Crossbar 互连可让多个主从设备同时通信。

TN=Tlat+(N−1)×Tbeat\displaystyle T_{N} = T_{\text{lat}} + (N - 1) \times T_{\text{beat}}

1. T_N——N 笔事务总耗时:从发出第一笔地址到最后一笔数据返回的总时间,是衡量批量搬运效率的核心指标。

TN=Tlat+(N−1)×Tbeat\displaystyle T_{N} = T_{\text{lat}} + (N - 1) \times T_{\text{beat}}

2. T_lat——首笔延迟:第一笔事务从发出地址到收到数据的往返延迟,包括地址排队、从设备反应时间等。

Tlat\displaystyle T_{\text{lat}}

3. T_beat——单拍数据时间:此后每拍数据通道便返回一笔数据,数据通道宽度决定每拍能搬多少比特。

Tbeat=1fclk\displaystyle T_{\text{beat}} = \frac{1}{f_{\text{clk}}}

outstanding 就像给高速公路装了不停车收费:头一辆车过了闸机后,后面每辆车按固定节奏快速通过,排队时间被摊薄到几乎为零。这也是为什么现代 AI 加速器与 DDR 之间几乎都用 AXI——模型权重必须在最短时间内从内存“灌”进计算阵列,任何一拍空等都会让算力空转。

仲裁与性能

城市有了路,还要有交叉口的秩序。AHB 这类共享总线上可能挂着多个主设备:CPU 要取指令,DMA 要搬运数据,NPU 要读权重——它们同时想上这条路,谁先谁后?这时就需要“交警”:总线仲裁器。

仲裁器统一接收各主设备的请求信号(如 AHB 的 HBUSREQ),按既定策略决定“绿灯”给谁(HGRANT);主设备看到自己被授权且总线空闲(HREADY 为高)后,才真正发起传输。常用策略有三种:固定优先级(fixed priority)简单直接,但低优先级请求可能一直等不到机会;轮询(round-robin)让所有主设备轮流使用,公平却不分轻重缓急;加权轮询和动态优先级则兼顾公平与实时性,适合音视频、网络这类有带宽保证需求的场景。AHB 还支持锁定传输(HLOCK),保证某主设备独占总线完成一组不可分割的操作。

仲裁本身消耗周期,从设备用 HREADY 插入的等待拍、流水建立拍也都是“无效拍”,于是总线有效带宽永远低于理论带宽。设计者的核心工作,就是把这些开销压缩到最小:减少仲裁延迟、让从设备尽快响应、用突发拉长有效数据段。

Beff=W×f×NdataNdata+Noverhead\displaystyle B_{\text{eff}} = W \times f \times \frac{N_{\text{data}}}{N_{\text{data}} + N_{\text{overhead}}}

1. B_eff——有效带宽:考虑仲裁、等待、流水建立等开销后,总线实际搬运数据的速率,才是系统真正感受到的速度。

Beff\displaystyle B_{\text{eff}}

2. N_data——有效数据拍:真正传输数据的时钟拍数,比如一次 8 笔突发中的 8 拍,相当于满载行驶的时长。

Ndata=Nbeat\displaystyle N_{\text{data}} = N_{\text{beat}}

3. N_overhead——开销拍:仲裁握手、HREADY 等待、流水建立等不产生数据的周期,优化性能就是尽量削减这一项。

Noverhead=Narb+Nwait\displaystyle N_{\text{overhead}} = N_{\text{arb}} + N_{\text{wait}}

交警(仲裁器)的作用不是让车变快,而是让路口不堵。好的仲裁策略就像智能红绿灯:高峰时优先放行数据量大的主设备(如 NPU),空闲时让大家轮流走。理解了这些开销,你就明白为什么同样频率的总线,在不同 SoC 上实测带宽会差出一大截。

工程选型实践

城市规划师最后要决定:哪些区域修高速、哪些修主干道、哪些留小巷。AI 芯片的 SoC 架构师做的是同样的事——为每个模块选择合适的总线接口。选错路,轻则浪费面积和功耗,重则让整个系统的数据流堵死。

三大总线的定位十分清晰。AXI 面向高性能点对点互连,支持 outstanding、乱序与多通道并行,适合 CPU↔DDR、NPU↔内存、多核一致性子系统;AHB 面向中等性能共享总线,结构紧凑、无乱序复杂度,适合 DMA、以太网 MAC、显示控制器等中速模块;APB 面向低速寄存器外设,无仲裁、两拍访问、可门控,适合 UART、SPI、I2C、GPIO、定时器和看门狗。桥接器按需放置:从 AXI/AHB 域到 APB 域之间通常只保留一级桥,避免“高速-主干道-小巷”层层转换引入过多延迟。

从带宽看,AXI 位宽最高(常见 128/256/512 位)且每拍都能传数据;APB 两拍才完成一笔,等效带宽只剩一半。因此“慢速外设挂 APB”不仅是方便,更是经济上的必然——高速总线上每多挂一个外设,都会增加布线负载与仲裁压力。现代趋势方面,AMBA 5 的 CHI 协议把缓存一致性引入互连网络,支持多核 CPU/GPU 集群共享数据;面向 AI 的 SoC 则大量使用 AXI Crossbar 与片上网络(NoC),让 NPU、DSP、视频编解码器并行访问各自的内存区域。

Bapb_eff=Wapb×fapb2\displaystyle B_{\text{apb\_eff}} = \frac{W_{\text{apb}} \times f_{\text{apb}}}{2}

1. W_apb——APB 位宽:APB 常见 8/16/32 位,位宽由外设需求决定,一般不需要很宽。

Wapb=32 bit\displaystyle W_{\text{apb}} = 32 \ \text{bit}

2. f_apb——APB 频率:典型只有几十 MHz,远低于 AXI 的数百 MHz 到 GHz 级,这是低功耗的代价与红利。

fapb=50 MHz\displaystyle f_{\text{apb}} = 50 \ \text{MHz}

3. 除以 2——两拍折半:每笔访问固定两拍,等效带宽直接减半,所以 APB 只适合小数据量的寄存器读写。

Bapb_eff=Wapb×fapb2\displaystyle B_{\text{apb\_eff}} = \frac{W_{\text{apb}} \times f_{\text{apb}}}{2}

最终,一颗芯片的互连方案就是一张精心规划的城市交通网:高速路(AXI)保证大动脉畅通,主干道(AHB)串联中等流量节点,小巷(APB)安静高效地服务海量小外设。看懂这张网,你再审视 AI 芯片系统框图时,就能一眼判断“数据从哪来、到哪去、会不会堵在哪”。

AI 应用场景

场景一:AI推理芯片的权重搬运

阶段:芯片系统架构设计

解决的问题:AI 推理时权重与特征图动辄数 MB 到数百 MB,若用串行或共享总线搬运,NPU 大部分时间在等数据、算力空转;传统总线无法同时满足高带宽与低延迟的需求。

具体案例:某边缘 NPU 芯片把 NPU 与 LPDDR4 之间的接口设计为 256 位 AXI4,工作频率 1.2GHz,理论带宽约 38GB/s。模型权重以 outstanding=16 的方式预取,CPU 同时通过另一路 AXI 读指令、写日志,互不干扰;摄像头与显示控制器挂在 AHB,UART/GPIO 挂在 APB。整颗芯片的推理帧率因此提升了约 3 倍。

场景二:低功耗语音唤醒芯片

阶段:低功耗系统设计 / 电源管理

解决的问题:物联网语音芯片常年待机,若所有外设都挂高速总线,时钟无法门控,待机电流居高不下,一颗纽扣电池撑不过一周。

具体案例:语音唤醒芯片把麦克风 PDM、按键、充电检测等慢速外设全部挂到 APB 域,主处理器空闲时由硬件关断 APB 时钟,仅保留唤醒源。访问一次电量计寄存器只需 2 拍 × 32MHz ≈ 62ns,能耗不到一次 AXI 事务的十分之一,整机待机电流从 2mA 降到 40µA。

场景三:多核AI服务器的缓存一致性

阶段:系统性能调优

解决的问题:多核并行训练时各核缓存同一份权重,若无硬件一致性,软件必须频繁刷写缓存,总线上充斥着无效回写流量,训练效率骤降。

具体案例:数据中心 AI 加速卡采用 AMBA 5 CHI 一致性互连,在总线上直接完成缓存监听与数据转发。权重更新只需在互连网络内广播一次,核间同步延迟从数百纳秒降到几十纳秒,多卡训练效率提升 40%。

Python 演示

python40 行
class Bus:    """用拍数和时钟频率估算一次突发传输的时间与带宽."""     def __init__(self, name, width_bits, freq_hz):        self.name = name        self.width_bits = width_bits        self.freq_hz = freq_hz     def clock_ns(self):        return 1000.0 / self.freq_hz     def transfer_ns(self, beats, pipelined):        # pipelined: 建立一拍后每拍一笔; serial: 每笔两拍        clocks = beats + 1 if pipelined else beats * 2        return clocks * self.clock_ns()     def bandwidth_gbps(self, beats, pipelined):        ns = self.transfer_ns(beats, pipelined)        bits = beats * self.width_bits        return bits / ns  # Gbps  def main():    beats = 8  # 一次突发8笔数据    buses = [        Bus('AHB', 128, 200e6),        Bus('APB', 32, 50e6),        Bus('AXI', 256, 1e9),    ]    print('%-4s %-9s %10s %12s' % ('bus', 'mode', 'time(ns)', 'bandwidth(Gbps)'))    for b in buses:        pipelined = b.name != 'APB'        mode = 'pipeline' if pipelined else 'serial'        t = b.transfer_ns(beats, pipelined)        bw = b.bandwidth_gbps(beats, pipelined)        print('%-4s %-9s %10.1f %12.2f' % (b.name, mode, t, bw))  if __name__ == '__main__':    main()
目的:用三类总线的典型参数模拟一次 8 笔突发传输,对比流水与串行模式下的耗时与带宽,直观验证 AXI/AHB/APB 的速度差异。
  1. clocks = beats + 1 if pipelined else beats * 2流水模式只为建立管线付 1 拍额外成本,串行模式每笔都要两拍,这正是 AHB 与 APB 的时间模型。
  2. pipelined = b.name != 'APB'APB 不支持流水,其余总线按流水模式计算,体现了协议选型对传输模型的约束。
  3. buses = [Bus('AHB', 128, 200e6), ...]用三类总线的典型位宽与频率构造模拟对象,参数都取自真实工程取值范围。
  4. bits = beats * self.width_bits总搬运比特数由突发笔数与位宽相乘得到,是后续带宽计算的基础。
  5. print('%-4s ...')以对齐表格输出,方便一眼对比三类总线的耗时与有效带宽差距。

常见误区

误区我以为总线带宽就是“频率乘位宽”,那只要拼命提高主频,所有数据都能跑得更快,买芯片先看总线主频高不高。

正解带宽公式里还有一个被忽略的效率 η。AHB 上从设备拉低 HREADY 等待、仲裁器切换主设备、流水线建立拍,都会产生“空拍”。频率翻倍,但如果等待拍也成倍增加,实测带宽可能纹丝不动,就像高速限速从 100 提到 120,但每个路口都在堵车,平均车速反而更慢。真正要提升的是“有效带宽”——减少空拍、加大位宽、增加 outstanding。

为何常见:厂商宣传时只爱标主频与位宽,新手容易被“理论极限”迷惑,忽略了协议开销这个隐藏变量。

误区既然 AXI 又快又能乱序,干脆把所有模块都挂 AXI,AHB 可以直接退役了。

正解AXI 的五通道、ID 乱序、outstanding 都要付出面积与功耗成本。中速共享型模块(如 DMA、以太网 MAC)用 AHB 可以显著降低布线与仲裁复杂度;一串低速寄存器外设挂 APB 才是功耗最优解。城市里高速路再快,也不该把每家便利店都建在高速边——路网的价值在于层次搭配,而非单一追求最快。

为何常见:技术文章常强调 AXI 的优势,容易让人误以为“新协议必然淘汰旧协议”,忽略了工程选型的成本权衡。

误区APB 一次访问要两拍,还没有突发,干脆所有外设都挂 AHB 算了。

正解APB 的价值在于低功耗、零仲裁、极简控制逻辑。一颗 SoC 上可能有几十个慢速外设,若全部挂到 AHB/AXI,总线上的仲裁负担、时钟负载和漏电都会显著上升。APB 配合时钟门控,在待机时整条总线时钟直接关掉,是移动设备续航的关键功臣。小巷虽然窄,但一整片街区的宁静都靠它维持。

为何常见:新人评判总线时只看快慢,忽视了功耗和面积在芯片里同样是硬指标。

误区向 DDR 发 outstanding=64 一定比 16 好,请求发得多,等待时间就能全部隐藏。

正解outstanding 数量受从设备队列深度、互连缓冲、内存 Bank 冲突等多重因素限制。请求冲过头,会在内存控制器里排队甚至触发重排序风暴,乱序缓冲和功耗同步上升,还可能让某些请求饿死。用公式 T_lat + (N-1)×T_beat 评估,只要延迟能被覆盖就已足够,再多只是浪费。就像高速收费站开再多的闸口,前方服务区容纳不下,车照样堵在匝道上。

为何常见:把“有利于隐藏延迟”简单外推成“多多益善”,忽略了端到端的整体瓶颈在从设备侧。

误区我写驱动就是配置寄存器,总线协议是 RTL 工程师的职责,跟我没有关系。

正解总线协议直接决定软件可见的内存映射、DMA 描述符格式、访问对齐要求与屏障(barrier)行为。不了解 AXI 的乱序特性,就可能写出依赖“先写后读”执行顺序的驱动;不了解 APB 的两拍访问,就可能误判外设状态寄存器的轮询时序。AI 推理框架的算子融合与内存规划,本质上都在围绕“总线上搬什么、怎么搬”做文章。

为何常见:软硬件分工让从业者各管一摊,但总线恰好站在软硬件交汇的边界,最需要跨界理解。

面试题

Q1. AMBA 总线规范最初是由哪家公司提出的?

单选题 · easy

  • A.Intel 公司
  • B.ARM 公司← 正确答案
  • C.AMD 公司
  • D.台积电公司

答案:B。AMBA 由 ARM 公司于 1996 年提出,如今手机、AI 芯片里的 AHB/AXI 接口都源自这部“道路规范”。Intel 与 AMD 是 CPU 厂商,台积电负责芯片制造,都不制定片上总线协议。

Q2. AHB 总线中地址相与数据相的关系是?

单选题 · mid

  • A.同一拍内完成
  • B.严格顺序串行
  • C.错开一拍重叠← 正确答案
  • D.由软件随机决定

答案:C。AHB 的核心特征是地址相与数据相错开一拍重叠,像流水线一样让下一笔地址提前进入。同一拍完成或严格串行分属传统总线与 APB 的行为,而软件随机决定则完全违背硬件时序。

Q3. APB 总线完成一次正常读或写访问需要几个时钟周期?

单选题 · mid

  • A.一个时钟周期
  • B.两个时钟周期← 正确答案
  • C.四个时钟周期
  • D.八个时钟周期

答案:B。APB 状态机固定走 SETUP 与 ACCESS 两拍,简单且可预测。一拍无法完成两次信号建立,四拍或八拍属于更复杂协议的开销,与 APB 极简定位不符。

Q4. 以下哪一项不是 AXI 总线的独立通道?

单选题 · mid

  • A.读地址通道
  • B.写数据通道
  • C.写响应通道
  • D.总线仲裁通道← 正确答案

答案:D。AXI 五通道是指读地址(AR)、读数据(R)、写地址(AW)、写数据(W)、写响应(B),并不存在仲裁通道。仲裁逻辑由互连的 Crossbar 或仲裁器在外部实现,不属于 AXI 通道本身。

Q5. AHB 中主设备申请使用总线的请求信号是?

单选题 · easy

  • A.HBUSREQ 请求信号← 正确答案
  • B.HREADY 就绪信号
  • C.HGRANT 授权信号
  • D.HRESP 响应信号

答案:A。主设备通过 HBUSREQ 向仲裁器“举手”请求总线;仲裁器发回 HGRANT 授权;HREADY 表示从设备本拍能否完成传输;HRESP 是传输响应。发起申请的是最开始的 HBUSREQ。

Q6. 关于 AXI 的 outstanding 传输,以下说法正确的有?

多选题 · hard

  • A.一笔未完成可继续发下一笔← 正确答案
  • B.可有效隐藏访问延迟← 正确答案
  • C.所有事务必须顺序返回
  • D.靠事务 ID 区分乱序结果← 正确答案

答案:ABD。outstanding 允许前一笔未完成就继续发送后续事务,并用每笔事务自带的 ID 支持乱序返回,从而把存储延迟“藏”起来。若要求严格顺序返回就退化为普通流水,失去了乱序与高吞吐的意义,因此 C 错误。

Q7. 桥接器在 AHB 到 APB 转换中起的主要作用是什么?

单选题 · mid

  • A.协议转换与速度匹配← 正确答案
  • B.提高外设工作频率
  • C.为外设增加突发能力
  • D.替代仲裁器的工作

答案:A。桥接器把高速总线协议翻译成 APB 的两拍协议,并完成地址译码与等待插入,本质是“匝道”式的协议转换与速度匹配。它不提升频率、不给外设加突发能力,仲裁职责仍在高速总线侧。

Q8. 某总线完成 4 笔突发传输,串行模式每笔需要 2 拍,改用 AHB 流水模式后共需 5 拍。相比串行节省了多少拍?

单选题 · hard

  • A.1 拍
  • B.2 拍
  • C.3 拍← 正确答案
  • D.4 拍

答案:C。串行 4 笔共 8 拍,AHB 流水建立 1 拍后每拍一笔,共 5 拍,节省 8-5=3 拍。这正是公式 N/(N+1) 的直观验证:流水线只多付一个建立拍,其余时间都被有效利用。

Q9. 关于 APB 总线的特点,以下说法正确的有?

多选题 · mid

  • A.支持低功耗设计← 正确答案
  • B.无需总线仲裁← 正确答案
  • C.支持流水与突发
  • D.适合低速寄存器外设← 正确答案

答案:ABD。APB 专为低速外设设计:无仲裁、两拍访问、可时钟门控,功耗极低,所以 A、B、D 正确。流水与突发是 AHB/AXI 才提供的特性,APB 为了实现极简与低功耗主动放弃了它们,C 错误。

Q10. 当两个主设备同时请求 AHB 总线时,仲裁器应当如何处置?

单选题 · hard

  • A.同时授权两者使用
  • B.按策略只授权一个← 正确答案
  • C.随机丢弃两个请求
  • D.复位系统重新开始

答案:B。共享总线同一时刻只能有一个主设备占用,仲裁器按固定优先级、轮询等策略选出一个并授权。同时授权会破坏总线协议;随机丢弃请求和复位系统都是灾难性处理,正确的做法永远是“按策略选一个”。